آسانسور
alternative label: بالابر
scope note: وسیله‌ای مکانیکی برای بالا و پایین بردن انسان یا کالا بین طبقات بنا.
related: حمل‌ونقل
broader: تجهیزات
preferred label: Elevator @en
type: Concept

حمل‌ونقل
preferred label: Transport @en
type: Concept
related: آسانسور

تجهیزات
preferred label: Equipment @en
type: Concept
narrower: آسانسور