Disaster victim
preferred label: قربانی فاجعه @fa
type: Concept
related: Disaster affected person

Casualties
preferred label: تلفات و زخمی‌ها @fa
type: Concept
related: Disaster affected person

Emergency affected person
preferred label: شخص متأثر از وضع اضطراری @fa
type: Concept
related: Disaster affected person

Disaster affected person
type: Concept
preferred label: شخص متأثر از فاجعه @fa
scope note: People, group or organisations that may experience benefit or harm as a result of a hazard, or of the process leading to risk characterisation, or of a decision about risk.
scope note: فرد، گروه یا سازمانی که نفع یا ضرر یک خطر، حادثه یا فاجعه را تجربه کند. @fa
related: Casualties
related: Disaster victim
related: Emergency affected person
alternative label: Affected person