سونامی
preferred label: Tsunami @en
type: Concept
related: سیستم هشداردهی سونامی

سیستم هشداردهی
preferred label: Warning system @en
type: Concept
narrower: سیستم هشداردهی سونامی

سیستم هشداردهی سونامی
alternative label: سیستم اعلام خطر سونامی
scope note: سیستم هشداردهنده در اقیانوس (آرام) و پایشگرهای لرزه‌نگاری برای پیش‌بینی سونامی.
related: سونامی
broader: سیستم هشداردهی
preferred label: Tsunami warning system @en
type: Concept