Forecasting
preferred label: پیش‌بینی @fa
type: Concept
narrower: Flood forecast

Flood forecast
type: Concept
broader: Forecasting
related: Flood prediction
related: Flood warning
related: Flood
preferred label: پیش‌بینی سیل @fa
scope note: پیش‌بینی مرحله تخلیه، آغاز و مدت استمرار سیل، به‌ویژه اوج تخلیه در نقطه خاصی از یک جریان آب که در نتیجه بارش یا ذوب برف‌ها به وجود آمده است. @fa
scope note: Prediction of the stage, discharge, beginning and duration of a flood, especially of the peak discharge at a specific point on a stream resulting from precipitation and/or snow melt.

Flood prediction
preferred label: پیشگویی سیل @fa
type: Concept
related: Flood forecast

Flood warning
preferred label: هشداردهی سیل @fa
type: Concept
related: Flood forecast

Flood
preferred label: سیل @fa
type: Concept
related: Flood forecast