سمیّت
alternative label: زهرآگینی
scope note: The degree being poisonous; the capability of a poisonous compound to produce deleterious effects on organisms such as alteration to behavioral patterns or biological productivity or death. @en
scope note: اثرات سمّی، به‌ویژه از جانب سموم دفع آفات گیاهی برای جانوران خونگرم.
related: ماده سمی
preferred label: Toxicity @en
type: Concept

ماده سمی
preferred label: Toxic material @en
type: Concept
related: سمیّت