Temporary housing
preferred label: مسکن موقت @fa
type: Concept
related: Emergency shelter

Emergency
preferred label: وضع اضطراری @fa
type: Concept
related: Emergency shelter

Shelter
preferred label: پناهگاه @fa
type: Concept
narrower: Emergency shelter

Evacuation center
preferred label: مرکز تخلیه و انتقال @fa
type: Concept
related: Emergency shelter

Emergency shelter
type: Concept
related: Temporary housing
related: Evacuation center
related: Emergency
broader: Shelter
preferred label: پناهگاه وضع اضطراری @fa
scope note: Group shelters provided for affected persons in a community hall or similar. They are part of emergency relief stage and are different from temporary accommodation.
scope note: پناهگاه‌های گروهی آماده شده برای افراد آسیب دیده در تالارها و سالن‌های جامعه محلی یا موارد مشابه. آنها بخشی از مرحله کمک‌رسانی بوده و با اقامتگاه‌های موقتی متفاوت هستند. @fa