پسماند‌
preferred label: Waste @en
type: Concept
narrower: مدیریت مواد پسماند

تصفیه پسماند
preferred label: Waste treatment @en
type: Concept
related: مدیریت مواد پسماند

مدیریت مواد پسماند
type: Concept
scope note: جمع‌آوری، حمل‌ونقل، دفع و همچنین عملیات تصفیه و فراوری پسمانده به منظور حفاظت کیفیت محیط زیست. این مدیریت شامل سیاستگذاری، تعیین استانداردهای زیست‌محیطی و نیز آگاه‌سازی دولت، صنایع، صاحبان معادن و زمینداران و عموم مردم که به هر شکل بر روی طبیعت کار می‌کنند می‌باشد.
scope note: The total process of waste collection, from its point of generation through its transportation, treatment, and final acceptable disposal. @en
related: تصفیه پسماند
related: دفع پسماند
preferred label: Waste management @en
alternative label: مدیریت پسماندها
broader: پسماند‌

دفع پسماند
preferred label: Waste disposal @en
type: Concept
related: مدیریت مواد پسماند