مهندسی مجدد
alternative label: بازمهندسی
scope note: Management strategies to improve effectiveness of operations and processes. @en
scope note: ساخت مجدد محصول در شکل جدید با مشخصات عملیاتی مناسبتر یا بازاندیشی بنیادی و طراحی نو و ریشه‌ای راهبردهای مدیریتی و فرایندها برای دستیابی به بهبود و پیشرفت در معیارهای امروزی همچون قیمت، کیفیت، خدمات و سرعت.
related: تغییر سازمانی
preferred label: Reengineering @en
type: Concept

تغییر سازمانی
preferred label: Organizational change @en
type: Concept
related: مهندسی مجدد