پزشکی الکترونیکی
scope note: نوعی طبایت که در آن ارتباط پزشک و بیمار از طریق اینترنت برقرار می شود.
broader: پزشکی
preferred label: Electronic medicine @en
type: Concept

پزشکی
preferred label: Medicine @en
type: Concept
narrower: پزشکی الکترونیکی