پزشکی قانونی
preferred label: Forensic medicine @en
type: Concept
narrower: کالبدشکافی

کالبدشکافی
alternative label: معاینه جسد
scope note: Postmortem examination of the body. @en
scope note: آزمایش جسد پس از مرگ. در پزشکی قانونی، اصولاً مرگ‌های غیر طبیعی مثل جنایات، مسمومیت‌ها، خودکشی‌ها، خفگی‌ها و مرگ در اثر حوادث گوناگون و مرگ‌های طبیعی در شرایط غیر عادی مثل مرگ در هتل‌ها یا در کنار خیابان‌ها و مرگ‌هایی که به هر صورت، شکایتی در پی داشته باشد، مورد بررسی یا کالبدشکافی قرار می‌گیرد.
broader: پزشکی قانونی
preferred label: Autopsy @en
type: Concept