پرس‌وجوی پزشک‌قانونی
preferred label: Coronial inquiry @en
type: Concept
related: پرس‌وجو در مورد مرگ مشکوک

پرس‌وجو در مورد مرگ مشکوک
scope note: تحقیقات قضایی یا رسمی و معمولاً تحقیقاتی که پزشک قانونی در باره مرگ‌هایی به‌عمل می‌آورد که علل غیرعادی داشته باشند.
related: پرس‌وجوی پزشک‌قانونی
related: پزشک قانونی
preferred label: Inquest @en
type: Concept

پزشک قانونی
preferred label: Coroner @en
type: Concept
related: پرس‌وجو در مورد مرگ مشکوک