Emergency management
preferred label: مدیریت وضع اضطراری @fa
type: Concept
related: Remote area

Disaster management
preferred label: مدیریت فاجعه @fa
type: Concept
related: Remote area

Remote area
scope note: Areas where because of distance, time or circumstance, the medical resources required to adequately manage the event are delayed to the potential detriment of the casualties.
scope note: مناطقی که به علت بعد مسافت و شرایط خاصی که دارند باید هر چه سریعتر در شرایط اضطراری اقدام شود تا از تلفات بیشتر جلوگیری به عمل آید. @fa
related: Disaster management
related: Emergency management
preferred label: منطقه دوردست @fa
type: Concept