پایگاه داده‌ها
alternative label: دادگان
scope note: مجموعه‌ای از داده‌های ذخیره شدۀ تحت کنترل یک مدیریت متمرکز که معمولاً مورد استفادۀ چندین کاربر به‌طور هم‌زمان و اشتراکی باشد.
related: رایانه
preferred label: Database @en
type: Concept

رایانه
preferred label: Computer @en
type: Concept
related: پایگاه داده‌ها