مهندسی مجدد
preferred label: Reengineering @en
type: Concept
related: تغییر سازمانی

سازمان
preferred label: Organization @en
type: Concept
narrower: تغییر سازمانی

تغییر سازمانی
scope note: دگرگونی در ساختار سازمان یا در اشکال معمول رفتار سازمانی.
related: مهندسی مجدد
broader: سازمان
preferred label: Organizational change @en
type: Concept