سازمان غیرانتفاعی
scope note: سازمانی که هیچ قسمت از عواید آن قابل توزیع بین مسئولان، شریکان یا اعضای آن نیست و اصولاً برای مقاصد غیر از تولید سود ایجاد شده است.
related: خدمات رفاهی
broader: سازمان
preferred label: Non profit organization @en
type: Concept

خدمات رفاهی
preferred label: Welfare services @en
type: Concept
related: سازمان غیرانتفاعی

سازمان
preferred label: Organization @en
type: Concept
narrower: سازمان غیرانتفاعی