Fire refuge area
alternative label: Refuge fire shelter
scope note: Areas which people may seek shelter from the danger of fire.
scope note: منطقه‌ای که مردم از خطر آتش‌‌سوزی به آنجا پناه می‌برند. @fa
related: Evacuation area
related: Assembly area
preferred label: منطقه ایمن از آتش‌سوزی @fa
type: Concept

Evacuation area
preferred label: منطقه تخلیه و انتقال @fa
type: Concept
related: Fire refuge area

Assembly area
preferred label: محل تجمع @fa
type: Concept
related: Fire refuge area