Flood frequency curve
scope note: A graphical representation of the relationship between peak flood discharge and exceedance probability.
scope note: نمایش گرافیکی ارتباط بین نقطه اوج تخلیه سیلاب و احتمال تجاوز بیش از حد آن. @fa
related: Flood
preferred label: منحنی فراوانی سیل @fa
type: Concept

Flood
preferred label: سیل @fa
type: Concept
related: Flood frequency curve