Dispersion
scope note: The process of dilution of a hazardous substance with the surrounding fluid.
scope note: فرایند رقیق‌سازی یک ماده خطرناک با مایع مجاور. @fa
related: Hazardous material
preferred label: پاشندگی @fa
type: Concept

Hazardous material
preferred label: ماده خطرناک @fa
type: Concept
related: Dispersion