Rehabilitation
preferred label: عادی‌سازی (وضع پس از بحران و فاجعه) @fa
type: Concept
related: Reconstruction

Reconstruction
scope note: Actions taken to re-establish a community after a period of rehabilitation subsequent to a disaster. Actions would include construction of permanent housing, full restoration of all services, and complete resumption of the pre-disaster state.
scope note: اقداماتی که برای برگرداندن جامعه به حالت اولیه، بعد از فاجعه یا بحران و بعد از زمان احیا صورت می‌گیرد، مثل احداث ساختمان‌های دائمی، بازسازی تمام خدمات، برگرداندن کامل جامعه به حالت قبل از حادثه، فاجعه و یا بحران به گونه‌ای که تمهیدات لازم برای مقاوم‌سازی و کاهش آسیب‌پذیری در بحران‌های بعدی منظور شود. @fa
related: Rehabilitation
preferred label: بازسازی @fa
type: Concept