Resource management
preferred label: مدیریت منابع @fa
type: Concept
broader: Resources

Resources
scope note: All personnel and equipment available, or potentially available, for incident tasks.
scope note: تمام کارکنان و تجهیزات و مواد موجود یا در دسترس برای انجام وظایف در برابر وقایع. @fa
narrower: Resource management
narrower: Human resources
preferred label: منابع @fa
type: Concept

Human resources
preferred label: منابع انسانی @fa
type: Concept
broader: Resources