Emergency personnel
preferred label: کارکنان وضع اضطراری @fa
type: Concept
related: Convergence

Emergency
preferred label: وضع اضطراری @fa
type: Concept
related: Convergence

Convergence
scope note: The propensity for emergency services personnel and others to be physically drawn to an emergency site.
scope note: گرایش به کارکنان خدمات اضطراری و دیگران به‌طوری که به سمت یک مکان اضطراری کشیده شوند. @fa
related: Emergency personnel
related: Emergency
preferred label: همگرایی @fa
type: Concept