Tsunami
preferred label: سونامی @fa
type: Concept
related: Tsunami intensity scale

Tsunami intensity scale
scope note: An intensity scale providing descriptions of six levels of tsunami intensity.
scope note: مقیاس توصیف شدت سونامی در شش سطح. در سال 2001 در 12 سطح پیشنهاد شده است. @fa
related: Tsunami
preferred label: مقیاس شدت سونامی @fa
type: Concept