Earthquake
preferred label: زلزله @fa
type: Concept
related: Richter scale

Richter scale
scope note: An open-ended logarithmic scale used to express the magnitude or total energy of a seismic disturbance (or earthquake). A measure of the amplitude of earthquake waves at their point of origin, giving an indication of how much energy has been released.
scope note: برای اندازه‌گیری وسعت یک زلزله است. این مقیاس دارای محدوده 0-10 است، اما تا به حال به بزرگترین زمین‌لرزه‌ها ارزش بین هشت و نیم و نه داده شده است. @fa
related: Earthquake
preferred label: مقیاس ریشتر @fa
type: Concept