دما
scope note: درجه حرارت، یعنی درجه گرمی یا سردی که با مقیاس معینی بر اساس پدیده فیزیکی مناسبی مثل انبساط جیوه در دماسنج اندازه‌گیری می‌شود.
narrower: اندازه‌گیری دما
narrower: دمای بدن
preferred label: Temperature @en
type: Concept

اندازه‌گیری دما
preferred label: Temperature measurement @en
type: Concept
broader: دما

دمای بدن
preferred label: Body temperature @en
type: Concept
broader: دما