احتمال خطر زیست‌محیطی
preferred label: Environmental risk @en
type: Concept
narrower: احتمال خطر بوم‌شناختی

احتمال خطر بوم‌شناختی
scope note: احتمال خطر ناشی از مواد شیمیایی مثل آفت‌کش‌ها و علف‌کش‌ها، پیامدهای مزمن فیزیولوژیکی و اثرات تولیدمثلی.
broader: احتمال خطر زیست‌محیطی
preferred label: Ecological risk @en
type: Concept