معماری
preferred label: Architecture @en
type: Concept
narrower: منطقه حساس زیست‌محیطی

منطقه حساس زیست‌محیطی
alternative label: منطقه از نظر زیست‌محیطی حساس
scope note: منطقه‌ای که از لحاظ حفاظت حیات وحش، مناظر، چشم‌انداز، ارزش تاریخی و جز اینها قابل توجه است.
related: احتمال خطر زیست‌محیطی
broader: معماری
preferred label: Environmentally sensitive area @en
type: Concept

احتمال خطر زیست‌محیطی
preferred label: Environmental risk @en
type: Concept
related: منطقه حساس زیست‌محیطی