Environmental impact
preferred label: پیامد زیست‌محیطی @fa
type: Concept
narrower: Environmental impact assessment

Environmental impact statement
preferred label: گزارش پیامد زیست‌محیطی @fa
type: Concept
related: Environmental impact assessment

Environmental impact assessment
scope note: An Environmental Impact Assessment (EIA) is an assessment of the likely human environmental health impact, risk to ecological health, and changes to nature's services that a project may have. The purpose of the assessment is to ensure that decision-makers consider environmental impacts before deciding whether to proceed with new projects.
scope note: بررسی، شناسایی و ارزیابی پیامدهای اجرای طرحها و بهره‌‌برداری از آنها بر روی محیط زیست توسط اجراکنندگان طرحها و تهیه گزارش پیامدهای زیست‌محیطی اجرای طرح و ارائه آن به سازمان حفاظت محیط زیست. ارزیابی پیامد زیست‌محیطی نوعی ارزیابی اثر بهداشت محیطی انسان، احتمال خطر برای بهداشت بوم‌شناختی و تغییر در خدمت رسانی به طبیعت است که یک طرح می‌تواند در پی داشته باشد. هدف از ارزیابی‌، تضمین آن است که تصمیم‌گیرندگان، پیامدهای محیطی را قبل از تصمیم‌گیری برای آغاز طرح‌های جدید در نظر می‌گیرند. @fa
related: Environmental impact statement
broader: Environmental impact
preferred label: ارزیابی پیامد زیست‌محیطی @fa
type: Concept