زمان
scope note: وقت یا هنگام. همچنین زمان استاندارد عبارت است از ساعت قراردادی متوسطی که در یک کشور برای تعیین وقت مورد استفاده قرار می‌گیرد.
narrower: مدت
narrower: تاریخ (زمان)
preferred label: Time @en
type: Concept

مدت
preferred label: Duration @en
type: Concept
broader: زمان

تاریخ (زمان)
preferred label: Date @en
type: Concept
broader: زمان