سوختگی (شیمیایی و گرمایی)
preferred label: Burn and scald @en
type: Concept
narrower: سوختگی شیمیایی

سوختگی شیمیایی
scope note: سوختگی ناشی از مواد شیمیایی صنعتی، مثل بخارهای استنشاقی و گازهای سوزاننده، عوامل شیمیایی خانگی، سود سوزآور، علف‌کش‌ها، سفیدکننده‌ها، پاک‌کننده‌های اجاق گاز یا هر گونه مواد اسیدی یا قلیایی دیگر. مصدوم را نخست باید از محل و منبع ماده شیمیایی دور کرد و سپس لباسهایش را خارج نمود و مواد شیمیایی جامد باقیمانده را از بدنش زدود و در مرحله بعد مصدوم را با مقدار زیاد آب روان به مدت بیست دقیقه شستشو داد.
broader: سوختگی (شیمیایی و گرمایی)
preferred label: Chemical burn @en
type: Concept