Environmental health officer
scope note: A term used to identify a health inspector/surveyor, Public health officer, Sanitary engineer, Engineer hygiene officer and Preventative medicine officer.
scope note: اصطلاح به کاربرده شده برای شناسایی بازرس، متصدی بهداشت، مأمور بهداشت همگانی، مهندس بهداشت، مأمور مهندسی بهداشت و مأمور پزشکی پیشگیری. @fa
related: Public health
broader: Environment
preferred label: متصدی بهداشت محیط @fa
type: Concept

Public health
preferred label: بهداشت عمومی @fa
type: Concept
related: Environmental health officer

Environment
preferred label: محیط زیست @fa
type: Concept
narrower: Environmental health officer