Environmental impact study
scope note: Studies undertaken in order assess the effect on a spcified environment of the introduction of any new factor which may upset the ecological balance.
scope note: مطالعه به منظور ارزیابی اثر بر روی محیط خاص برای شناسایی هر عامل جدیدی که ممکن است باعث برهم زدن تعادل بوم‌شناختی گردد. @fa
related: Environmental risk assessment
related: Environmental risk
broader: Environment
preferred label: مطالعه پیامد زیست‌محیطی @fa
type: Concept

Environmental risk assessment
preferred label: ارزیابی احتمال خطر زیست‌محیطی @fa
type: Concept
related: Environmental impact study

Environmental risk
preferred label: احتمال خطر زیست‌محیطی @fa
type: Concept
related: Environmental impact study

Environment
preferred label: محیط زیست @fa
type: Concept
narrower: Environmental impact study