زلزله
preferred label: Earthquake @en
type: Concept
related: روانگرایی

روانگرایی
alternative label: آبگون شدن
scope note: Process of soil and sand behaving like a dense fluid rather than a wet soil mass during an earthquake. @en
scope note: این فرایند تحت تأثیر لرزش (ناشی از زلزله، انبساط خاک و غیره) در خاک‌هایی با مقاومت پایین ، چسبندگی کم و اشباع ایجاد می‌گردد. در این فرایند سطح تماس ذرات خاک در یک لحظه کمتر شده و خاک رفتار روان از خود نشان می‌دهد. مثلاً اگر در عمق کمتر از 8 متری سطح زمین، خاک از ماسه‌های یکدست ناپیوسته سستی که از آب اشباع است، تشکیل شده باشد، ممکن است در اثر زلزله شدید رفتار این خاک مانند رفتار یک سیال باشد، یعنی خاک به صورت فوران و جوشش گل و ماسه در سطح زمین بروز می‌کند. در نتیجه، امکان دارد ساختمان‌هایی که بر روی چنین زمینی بنا شده‌اند، فروریزند یا کج شوند.
related: زلزله
preferred label: Liquefaction @en
type: Concept