Windbreak
scope note: A barrier used to decrease he wind spread.
scope note: وسیله‌ای طراحی شده برای جلوگیری از جریان باد و حفاظت در برابر آثار مخرب آن. @fa
related: Windstorm
related: Wind
preferred label: بادشکن @fa
type: Concept

Windstorm
preferred label: توفان باد @fa
type: Concept
related: Windbreak

Wind
preferred label: باد @fa
type: Concept
related: Windbreak