Aeronautics
preferred label: هوانوردی @fa
type: Concept
related: Aerodynamics

Aerodynamics
scope note: Studyof interaction between air and solid bodies moving through it.
scope note: مطالعه اثر متقابل هوا و جامدات حرکت کننده در آن. @fa
related: Aeronautics
preferred label: آئرودینامیک @fa
type: Concept