Emergency procedure
scope note: A set of directions detailing what actions dhould be taken, as well as how, when, by whom and why, for specific emergency events.
scope note: مجموعه‌ای از راهنمایی‌ها همراه با جزئیات کارهایی که باید انجام گیرد، چگونگی آن، زمان، شخص انجام‌دهنده و علت آن در رویدادهای اضطراری خاص. @fa
related: Standard operating procedure
related: Emergency
broader: Procedure
preferred label: دستورالعمل وضع اضطراری @fa
type: Concept

Standard operating procedure
preferred label: دستورالعمل عملیاتی استاندارد @fa
type: Concept
related: Emergency procedure

Emergency
preferred label: وضع اضطراری @fa
type: Concept
related: Emergency procedure

Procedure
preferred label: دستورالعمل @fa
type: Concept
narrower: Emergency procedure