ماهواره
preferred label: Satellite @en
type: Concept
narrower: سیستم ارتباطات ماهواره‌ای

سیستم ارتباطات ماهواره‌ای
scope note: سیستم‌های ارتباطات و مخابرات از جمله سیستم‌هایی هستند که در اثر وقایع و حوادث دچار مشکل می‌شوند و در کار مدیریت بحران وقفه ایجاد می‌کنند. بنابراین، نیاز به سیستم‌هایی که حداقل وابستگی را به تأسیسات و زیرساختهای زمینی داشته باشند احساس می‌شود. سیستم‌های ارتباطات ماهواره‌ای راه حل مناسبی است زیرا تأسیسات اصلی آنها خارج از جوّ زمین قرار دارد. اینک دو نوع شبکه ارتباطات ماهواره‌ای برای استفاده در مدیریت بحران وجود دارد: سیستم‌های ماهواره‌ای زمین‌مبنا و سیستم‌های ماهواره‌ای مدار پایین زمین.
broader: ماهواره
preferred label: Satellite communications system @en
type: Concept