Alert
preferred label: آماده‌باش @fa
type: Concept
narrower: Weather alert

Weather
preferred label: وضع هوا @fa
type: Concept
related: Weather alert

Weather alert
scope note: A warning broadcast on radio or television of an approaching storm or gale, or of an impending cold change.
scope note: پخش هشدار از رادیو یا تلویزیون مبنی بر نزدیک شدن توفان، تندباد، سرمای تهدیدکننده و مانند اینها. @fa
related: Weather
broader: Alert
preferred label: آماده‌باش وضع هوا @fa
type: Concept