هشداردهی
preferred label: Warning @en
type: Concept
related: آماده‌باش

آماده‌باش
type: Concept
preferred label: Alert @en
alternative label: حالت آماده‌باش
narrower: آماده‌باش وضع هوا
related: هشداردهی
related: هشدار
scope note: حالتی که به موجب آن، اشخاص با آگاهی از خطر یا تهدید، برای هر نوع عملیات آماده می‌شوند.
scope note: The period when it is believed that resources may be required which enables an increased level of preparedness. @en

آماده‌باش وضع هوا
preferred label: Weather alert @en
type: Concept
broader: آماده‌باش

هشدار
preferred label: Alarm @en
type: Concept
related: آماده‌باش