Carcinogen
scope note: Agents which are responsible for the formation of a cancer.
scope note: عامل مؤثر در شکل‌گیری سرطان. سرطانزاها ممکن است از راههای مختلف وارد بدن شوند. مثلاً دود و الیاف پنبه نسوز از راه تنفس، رنگ مو از راه پوست و غذاهای فاسد از راه گوارش وارد بدن می‌شوند. @fa
related: Asbestos
broader: Hazardous material
preferred label: سرطانزا @fa
type: Concept

Asbestos
preferred label: پنبه نسوز @fa
type: Concept
related: Carcinogen

Hazardous material
preferred label: ماده خطرناک @fa
type: Concept
narrower: Carcinogen