آلودگی ماده پرتوزا
scope note: آلودگی ناشی از مواد پرتوزای پراکنده در محیط که از طریق تنفس، بلع، جذب پوستی و مانند اینها به جانداران آسیب وارد می‌شود.
broader: ماده پرتوزا
preferred label: Radioactive pollution @en
type: Concept

ماده پرتوزا
preferred label: Radioactive material @en
type: Concept
narrower: آلودگی ماده پرتوزا