Corrosion
preferred label: خوردگی @fa
type: Concept
related: Corrosive material

Corrosive material
type: Concept
narrower: Corrosive materials transport
narrower: Corrosive materials storage
preferred label: ماده خورنده @fa
scope note: ماده‌ای که با اعمال شیمیایی موجب آسیب جدی به بافت زنده شود یا به سایر مواد، به‌ویژه فلزات آسیب رساند یا آنها را از بین ببرد. @fa
scope note: Materials which, by chemical action, will cause severe damage in contact with living tissue, or will damage or even destroy other materials, especially metals (Dangerous Goods Class 8).
related: Corrosion
broader: Hazardous material
alternative label: Corrosive substance

Corrosive materials transport
preferred label: حمل‌ونقل مواد خورنده @fa
type: Concept
broader: Corrosive material

Corrosive materials storage
preferred label: ذخیره‌سازی مواد خورنده @fa
type: Concept
broader: Corrosive material

Hazardous material
preferred label: ماده خطرناک @fa
type: Concept
narrower: Corrosive material