ماده سمی
preferred label: Toxic material @en
type: Concept
narrower: گاز سمی

گاز سمی
scope note: هر یک از گازهای گوناگونی که به علت دارا بودن سمیّت به‌طور عمده در جنگ به کار می‌روند، مثل گازهای تاول‌زا، گازهای اشک‌آور و گازهای عصبی.
related: سم
broader: ماده سمی
preferred label: Toxic gas @en
type: Concept

سم
preferred label: Poison @en
type: Concept
related: گاز سمی