Toxicity
preferred label: سمیّت @fa
type: Concept
related: Toxic material

Toxic liquid
preferred label: مایع سمی @fa
type: Concept
broader: Toxic material

Toxic material
type: Concept
preferred label: ماده سمی @fa
narrower: Toxic liquid
narrower: Toxic gas
scope note: موادی که در صورت بلعیدن، استنشاق، تماس با پوست یا از طریق ارگانیسم‌های آلوده می‌توانند باعث مرگ یا آسیب جدی شوند. @fa
scope note: Materials or substances which are liable to cause death or serious injury to health if swallowed, inhaled or by skin contact or by direct infection through organisms.
related: Poison
related: Toxicity
broader: Hazardous material
alternative label: Toxic substance

Toxic gas
preferred label: گاز سمی @fa
type: Concept
broader: Toxic material

Poison
preferred label: سم @fa
type: Concept
related: Toxic material

Hazardous material
preferred label: ماده خطرناک @fa
type: Concept
narrower: Toxic material