علف‌کش
scope note: عواملی که برای از بین بردن علف‌های هرز و ناخواسته به‌کار می‌رود و معمولاً از مواد شیمیایی است.
broader: آفت‌کش
preferred label: Herbicide @en
type: Concept

آفت‌کش
preferred label: Pesticide @en
type: Concept
narrower: علف‌کش