لرزه‌شناسی
alternative label: زلزله‌شناسی
scope note: The study earthquakes, seismic sources and wave propagation through the earth. @en
scope note: علمی که در آن از وقوع، محل و خواص زلزله و تولید و انتشار و آثار امواج لرزه‌ای و طرح و ساختمان و طرز کار لرزه نگار بحث می‌شود.
related: زلزله
preferred label: Seismology @en
type: Concept

زلزله
preferred label: Earthquake @en
type: Concept
related: لرزه‌شناسی