Alarm system
preferred label: سیستم هشدار @fa
type: Concept
related: Gas detector

Detector
preferred label: آشکارساز @fa
type: Concept
narrower: Gas detector

Gas detector
scope note: A detector which responds to, and will give warning of, a predetermined concentration of a particular gas.
scope note: آشکارکننده‌ای که نسبت به غلظت از پیش تعیین شده نوع خاصی از گاز واکنش داده و هشدار دهد. @fa
related: Alarm system
broader: Detector
preferred label: آشکارساز گازی @fa
type: Concept