Vulnerability assessment
preferred label: ارزیابی آسیب‌پذیری @fa
type: Concept
related: Vulnerability analysis

Vulnerability analysis
scope note: فرایند برآورد آسیب‌پذیری عناصر معینی که در معرض خطر احتمالی ناشی از وقوع خطرهای مصیبت بار هستند. در اصطلاح مهندسی، تجزیه و تحلیل آسیب‌پذیری به تجزیه و تحلیل اطلاعات نظری و تجربی مربوط به اثرات یک پدیده خاص بر روی یک نوع ساختار خاص اطلاق می‌شود. در مفاهیم کلی‌تر اقتصادی و اجتماعی، تجزیه وتحلیل آسیب‌پذیری تمام عناصر مهم در جامعه از جمله مسائل طبیعی، اجتماعی و اقتصادی اعم از کوتاه مدت و دراز مدت را در بر می‌گیرد. @fa
scope note: assessment of elements in the community that are subject to damage should a hazardous material release occure.
related: Vulnerability assessment
broader: Vulnerability
preferred label: تجزیه و تحلیل آسیب‌پذیری @fa
type: Concept

Vulnerability
preferred label: آسیب‌پذیری @fa
type: Concept
narrower: Vulnerability analysis