خطر اقیانوس‌شناختی
scope note: خطرهایی مثل سونامی و چرخند. در سال‌های اخیر، سرعت پژوهش‌ها در اقیانوس‌ها بیشتر شده است. با فناوری‌های جدید، هر روز یافته‌های بیشتری از این آب‌ها به دست می‌آید. در عمق 1000 متری این آب‌هاکه بسیار تاریک است، سفرهای پژوهشی بسیار دشوار و مخاطره‌آمیز است. در واقع، حتی روی آب‌های اقیانوس‌ها نیز کم خطر نیست.
broader: خطر طبیعی
preferred label: Oceanographic hazard @en
type: Concept

خطر طبیعی
preferred label: Natural hazard @en
type: Concept
narrower: خطر اقیانوس‌شناختی