خطر زلزله
scope note: خطر وقوع زلزله و اثرات مخرب آن. دارا بودن خطر بالا برای منطقه‌ای به مفهوم آن است که منطقه مذکور، مستعد وقوع زلزله‌ای با شدت بالا است. در ایران به‌ویژه در دامنه‌های البرز، زلزله‌های مخرب با فاصله زمانی زیادی روی می‌دهند ولی همین امر یعنی فاصله زمانی زیاد، موجب می‌شود که مردم، آمادگی خود را از دست بدهند. هرچه از زمان زلزله پیشین بیشتر بگذرد، به زلزله بعدی بیشتر نزدیک می‌شویم.
related: سونامی
broader: خطر طبیعی
preferred label: Earthquake hazard @en
type: Concept

سونامی
preferred label: Tsunami @en
type: Concept
related: خطر زلزله

خطر طبیعی
preferred label: Natural hazard @en
type: Concept
narrower: خطر زلزله