خطر زمین‌شناختی
preferred label: Geological hazard @en
type: Concept
narrower: جریان گل

جریان گل
alternative label: روانه گل
scope note: The down slope transfer of the earth material mixed with water. @en
scope note: حرکت توده‌ای از گل که بر اثر ریزش باران روی دامنه‌ها و یا نفوذ آب ناشی از ذوب برف‌ها به سوی پایین دامنه‌ها به جریان می‌افتد و ممکن است خساراتی به کشاورزی و نواحی مسکونی بزند.
broader: خطر زمین‌شناختی
preferred label: Mud flow @en
type: Concept